2026-10-08T20:22:58.4790574Z FAILED tests/test_distribution_identity.py::test_identity_precedes_package_execution[release-enterprise.yml] - UnicodeDecodeError: 'charmap' codec can't decode byte 0x9d in position 4830: character maps to <undefined>
2026-10-08T20:22:58.4790970Z FAILED tests/test_installed_definition_interface.py::test_installed_cli_help - FileNotFoundError: [WinError 2] The system cannot find the file specified
2026-10-08T20:22:58.4791651Z FAILED tests/test_installed_release_gate.py::test_shared_acceptance_is_required_before_upload[release-enterprise.yml] - UnicodeDecodeError: 'charmap' codec can't decode byte 0x9d in position 4830: character maps to <undefined>
2026-10-08T20:22:58.4792156Z FAILED tests/test_rc_source_ci.py::test_validation_branch_runs_canonical_checks[ci.yml] - UnicodeDecodeError: 'charmap' codec can't decode byte 0x9d in position 2621: character maps to <undefined>
2026-10-08T20:22:58.4792652Z FAILED tests/test_rc_source_ci.py::test_rc_and_stable_require_identical_source_gate - UnicodeDecodeError: 'charmap' codec can't decode byte 0x9d in position 4830: character maps to <undefined>
2026-10-08T20:22:58.4793140Z FAILED tests/test_rc_source_ci.py::test_validation_forces_full_ci_without_parent_diff - UnicodeDecodeError: 'charmap' codec can't decode byte 0x9d in position 2621: character maps to <undefined>
2026-10-08T20:22:58.4793699Z FAILED tests/test_release_ownership.py::test_tag_push_has_no_publication_owner[v7.5.0] - UnicodeDecodeError: 'charmap' codec can't decode byte 0x9d in position 2621: character maps to <undefined>
2026-10-08T20:22:58.4794676Z FAILED tests/test_release_ownership.py::test_tag_push_has_no_publication_owner[v10.20.30] - UnicodeDecodeError: 'charmap' codec can't decode byte 0x9d in position 2621: character maps to <undefined>
2026-10-08T20:22:58.4795376Z FAILED tests/test_release_ownership.py::test_tag_push_has_no_publication_owner[v7.5.0rc1] - UnicodeDecodeError: 'charmap' codec can't decode byte 0x9d in position 2621: character maps to <undefined>
2026-10-08T20:22:58.4795989Z FAILED tests/test_release_ownership.py::test_tag_push_has_no_publication_owner[v10.20.30rc12] - UnicodeDecodeError: 'charmap' codec can't decode byte 0x9d in position 2621: character maps to <undefined>
2026-10-08T20:22:58.4796674Z FAILED tests/test_release_ownership.py::test_tag_push_has_no_publication_owner[baseline/project-health-start] - UnicodeDecodeError: 'charmap' codec can't decode byte 0x9d in position 2621: character maps to <undefined>
2026-10-08T20:22:58.4797367Z FAILED tests/test_release_ownership.py::test_tag_push_has_no_publication_owner[codex/p04-single-release-owner] - UnicodeDecodeError: 'charmap' codec can't decode byte 0x9d in position 2621: character maps to <undefined>
2026-10-08T20:22:58.4797974Z FAILED tests/test_release_ownership.py::test_only_two_manual_publication_entrypoints - UnicodeDecodeError: 'charmap' codec can't decode byte 0x9d in position 2621: character maps to <undefined>
2026-10-08T20:22:58.4798714Z FAILED tests/test_release_ownership.py::test_actual_validation_script_routes_manual_and_push[v7.5.0-push-release-enterprise.yml] - UnicodeDecodeError: 'charmap' codec can't decode byte 0x9d in position 4830: character maps to <undefined>
2026-10-08T20:22:58.4799496Z FAILED tests/test_release_ownership.py::test_actual_validation_script_routes_manual_and_push[v7.5.0-workflow_dispatch-release-enterprise.yml] - UnicodeDecodeError: 'charmap' codec can't decode byte 0x9d in position 4830: character maps to <undefined>
2026-10-08T20:22:58.4800254Z FAILED tests/test_release_ownership.py::test_actual_validation_script_routes_manual_and_push[v7.5.0rc1-push-release-enterprise.yml] - UnicodeDecodeError: 'charmap' codec can't decode byte 0x9d in position 4830: character maps to <undefined>
2026-10-08T20:22:58.4801403Z FAILED tests/test_release_ownership.py::test_actual_validation_script_routes_manual_and_push[v7.5.0rc1-workflow_dispatch-release-enterprise.yml] - UnicodeDecodeError: 'charmap' codec can't decode byte 0x9d in position 4830: character maps to <undefined>
2026-10-08T20:22:58.4802182Z FAILED tests/test_release_ownership.py::test_actual_validation_script_routes_manual_and_push[not-a-version-push-release-enterprise.yml] - UnicodeDecodeError: 'charmap' codec can't decode byte 0x9d in position 4830: character maps to <undefined>
2026-10-08T20:22:58.4804910Z FAILED tests/test_release_ownership.py::test_actual_validation_script_routes_manual_and_push[not-a-version-workflow_dispatch-release-enterprise.yml] - UnicodeDecodeError: 'charmap' codec can't decode byte 0x9d in position 4830: character maps to <undefined>
2026-10-08T20:22:58.4805521Z FAILED tests/test_release_ownership.py::test_stable_gate_graph_and_matrix_retained - UnicodeDecodeError: 'charmap' codec can't decode byte 0x9d in position 4830: character maps to <undefined>
2026-10-08T20:22:58.4806200Z FAILED tests/test_release_ref_safety.py::test_manual_publication_configuration[release-enterprise.yml] - UnicodeDecodeError: 'charmap' codec can't decode byte 0x9d in position 4830: character maps to <undefined>
2026-10-08T20:22:58.4806994Z FAILED tests/test_release_ref_safety.py::test_publication_dispatch_refuses_unconfirmed_or_mismatched_source[overrides0-release-enterprise.yml] - UnicodeDecodeError: 'charmap' codec can't decode byte 0x9d in position 4830: character maps to <undefined>
2026-10-08T20:22:58.4807805Z FAILED tests/test_release_ref_safety.py::test_publication_dispatch_refuses_unconfirmed_or_mismatched_source[overrides1-release-enterprise.yml] - UnicodeDecodeError: 'charmap' codec can't decode byte 0x9d in position 4830: character maps to <undefined>
2026-10-08T20:22:58.4808594Z FAILED tests/test_release_ref_safety.py::test_publication_dispatch_refuses_unconfirmed_or_mismatched_source[overrides2-release-enterprise.yml] - UnicodeDecodeError: 'charmap' codec can't decode byte 0x9d in position 4830: character maps to <undefined>
2026-10-08T20:22:58.4809377Z FAILED tests/test_release_ref_safety.py::test_publication_dispatch_refuses_unconfirmed_or_mismatched_source[overrides3-release-enterprise.yml] - UnicodeDecodeError: 'charmap' codec can't decode byte 0x9d in position 4830: character maps to <undefined>
2026-10-08T20:22:58.4810278Z FAILED tests/test_release_ref_safety.py::test_publication_dispatch_refuses_unconfirmed_or_mismatched_source[overrides4-release-enterprise.yml] - UnicodeDecodeError: 'charmap' codec can't decode byte 0x9d in position 4830: character maps to <undefined>
2026-10-08T20:22:58.4811056Z FAILED tests/test_release_ref_safety.py::test_publication_dispatch_refuses_unconfirmed_or_mismatched_source[overrides5-release-enterprise.yml] - UnicodeDecodeError: 'charmap' codec can't decode byte 0x9d in position 4830: character maps to <undefined>
2026-10-08T20:22:58.4811832Z FAILED tests/test_release_ref_safety.py::test_publication_dispatch_refuses_unconfirmed_or_mismatched_source[overrides6-release-enterprise.yml] - UnicodeDecodeError: 'charmap' codec can't decode byte 0x9d in position 4830: character maps to <undefined>
2026-10-08T20:22:58.4812637Z FAILED tests/test_release_ref_safety.py::test_publication_dispatch_refuses_unconfirmed_or_mismatched_source[overrides7-release-enterprise.yml] - UnicodeDecodeError: 'charmap' codec can't decode byte 0x9d in position 4830: character maps to <undefined>
2026-10-08T20:22:58.4813426Z FAILED tests/test_release_ref_safety.py::test_publication_dispatch_refuses_unconfirmed_or_mismatched_source[overrides8-release-enterprise.yml] - UnicodeDecodeError: 'charmap' codec can't decode byte 0x9d in position 4830: character maps to <undefined>
2026-10-08T20:22:58.4814210Z FAILED tests/test_release_ref_safety.py::test_publication_dispatch_refuses_unconfirmed_or_mismatched_source[overrides9-release-enterprise.yml] - UnicodeDecodeError: 'charmap' codec can't decode byte 0x9d in position 4830: character maps to <undefined>
2026-10-08T20:22:58.8836837Z FAILED tests/test_release_ref_safety.py::test_publication_dispatch_refuses_unconfirmed_or_mismatched_source[overrides10-release-enterprise.yml] - UnicodeDecodeError: 'charmap' codec can't decode byte 0x9d in position 4830: character maps to <undefined>
2026-10-08T20:22:58.8839854Z FAILED tests/test_release_ref_safety.py::test_tag_channel_and_sha[v7.5.0-push-release-enterprise.yml] - UnicodeDecodeError: 'charmap' codec can't decode byte 0x9d in position 4830: character maps to <undefined>
2026-10-08T20:22:58.8840838Z FAILED tests/test_release_ref_safety.py::test_tag_channel_and_sha[v7.5.0-workflow_dispatch-release-enterprise.yml] - UnicodeDecodeError: 'charmap' codec can't decode byte 0x9d in position 4830: character maps to <undefined>
2026-10-08T20:22:58.8841380Z FAILED tests/test_release_ref_safety.py::test_tag_channel_and_sha[v7.5.0rc1-push-release-enterprise.yml] - UnicodeDecodeError: 'charmap' codec can't decode byte 0x9d in position 4830: character maps to <undefined>
2026-10-08T20:22:58.8841988Z FAILED tests/test_release_ref_safety.py::test_tag_channel_and_sha[v7.5.0rc1-workflow_dispatch-release-enterprise.yml] - UnicodeDecodeError: 'charmap' codec can't decode byte 0x9d in position 4830: character maps to <undefined>
2026-10-08T20:22:58.8842560Z FAILED tests/test_release_ref_safety.py::test_tag_channel_and_sha[not-a-version-push-release-enterprise.yml] - UnicodeDecodeError: 'charmap' codec can't decode byte 0x9d in position 4830: character maps to <undefined>
2026-10-08T20:22:58.8843166Z FAILED tests/test_release_ref_safety.py::test_tag_channel_and_sha[not-a-version-workflow_dispatch-release-enterprise.yml] - UnicodeDecodeError: 'charmap' codec can't decode byte 0x9d in position 4830: character maps to <undefined>
2026-10-08T20:22:58.8843787Z FAILED tests/test_release_ref_safety.py::test_manual_input_cannot_execute_or_emit_outputs[$(touch injected)-release-enterprise.yml] - UnicodeDecodeError: 'charmap' codec can't decode byte 0x9d in position 4830: character maps to <undefined>
2026-10-08T20:22:58.8844409Z FAILED tests/test_release_ref_safety.py::test_manual_input_cannot_execute_or_emit_outputs["; touch injected; #-release-enterprise.yml] - UnicodeDecodeError: 'charmap' codec can't decode byte 0x9d in position 4830: character maps to <undefined>
2026-10-08T20:22:58.8845037Z FAILED tests/test_release_ref_safety.py::test_manual_input_cannot_execute_or_emit_outputs[v7.5.0\nsha=forged-release-enterprise.yml] - UnicodeDecodeError: 'charmap' codec can't decode byte 0x9d in position 4830: character maps to <undefined>
2026-10-08T20:22:58.8845634Z FAILED tests/test_release_ref_safety.py::test_manual_input_cannot_execute_or_emit_outputs[--help-release-enterprise.yml] - UnicodeDecodeError: 'charmap' codec can't decode byte 0x9d in position 4830: character maps to <undefined>
2026-10-08T20:22:58.8846208Z FAILED tests/test_release_ref_safety.py::test_manual_input_cannot_execute_or_emit_outputs[-release-enterprise.yml] - UnicodeDecodeError: 'charmap' codec can't decode byte 0x9d in position 4830: character maps to <undefined>
2026-10-08T20:22:58.8846780Z FAILED tests/test_release_ref_safety.py::test_missing_tag_and_same_named_branch_rejected[release-enterprise.yml] - UnicodeDecodeError: 'charmap' codec can't decode byte 0x9d in position 4830: character maps to <undefined>
2026-10-08T20:22:58.8847259Z FAILED tests/test_release_ref_safety.py::test_stable_off_main_rejected_but_rc_allowed - UnicodeDecodeError: 'charmap' codec can't decode byte 0x9d in position 4830: character maps to <undefined>
2026-10-08T20:22:58.8847720Z FAILED tests/test_release_ref_safety.py::test_stable_missing_main_ref_rejected - UnicodeDecodeError: 'charmap' codec can't decode byte 0x9d in position 4830: character maps to <undefined>
2026-10-08T20:22:58.8848269Z FAILED tests/test_release_ref_safety.py::test_downstream_checkouts_bind_validated_sha[release-enterprise.yml] - UnicodeDecodeError: 'charmap' codec can't decode byte 0x9d in position 4830: character maps to <undefined>
2026-10-08T20:22:58.8849243Z FAILED tests/test_release_ref_safety.py::test_actual_checkout_verification[valid-release-enterprise.yml-build] - UnicodeDecodeError: 'charmap' codec can't decode byte 0x9d in position 4830: character maps to <undefined>
2026-10-08T20:22:58.8849861Z FAILED tests/test_release_ref_safety.py::test_actual_checkout_verification[valid-release-enterprise.yml-verify-source-checks] - UnicodeDecodeError: 'charmap' codec can't decode byte 0x9d in position 4830: character maps to <undefined>
2026-10-08T20:22:58.8850746Z FAILED tests/test_release_ref_safety.py::test_actual_checkout_verification[valid-release-enterprise.yml-test-built-artifact] - UnicodeDecodeError: 'charmap' codec can't decode byte 0x9d in position 4830: character maps to <undefined>
2026-10-08T20:22:58.8851651Z FAILED tests/test_release_ref_safety.py::test_actual_checkout_verification[valid-release-enterprise.yml-test-testpypi-install] - UnicodeDecodeError: 'charmap' codec can't decode byte 0x9d in position 4830: character maps to <undefined>
2026-10-08T20:22:58.8852385Z FAILED tests/test_release_ref_safety.py::test_actual_checkout_verification[valid-release-enterprise.yml-create-github-release] - UnicodeDecodeError: 'charmap' codec can't decode byte 0x9d in position 4830: character maps to <undefined>
2026-10-08T20:22:58.8853129Z FAILED tests/test_release_ref_safety.py::test_actual_checkout_verification[wrong_head-release-enterprise.yml-build] - UnicodeDecodeError: 'charmap' codec can't decode byte 0x9d in position 4830: character maps to <undefined>
2026-10-08T20:22:58.8853874Z FAILED tests/test_release_ref_safety.py::test_actual_checkout_verification[wrong_head-release-enterprise.yml-verify-source-checks] - UnicodeDecodeError: 'charmap' codec can't decode byte 0x9d in position 4830: character maps to <undefined>
2026-10-08T20:22:58.8854594Z FAILED tests/test_release_ref_safety.py::test_actual_checkout_verification[wrong_head-release-enterprise.yml-test-built-artifact] - UnicodeDecodeError: 'charmap' codec can't decode byte 0x9d in position 4830: character maps to <undefined>
2026-10-08T20:22:58.8855352Z FAILED tests/test_release_ref_safety.py::test_actual_checkout_verification[wrong_head-release-enterprise.yml-test-testpypi-install] - UnicodeDecodeError: 'charmap' codec can't decode byte 0x9d in position 4830: character maps to <undefined>
2026-10-08T20:22:58.8856076Z FAILED tests/test_release_ref_safety.py::test_actual_checkout_verification[wrong_head-release-enterprise.yml-create-github-release] - UnicodeDecodeError: 'charmap' codec can't decode byte 0x9d in position 4830: character maps to <undefined>
2026-10-08T20:22:58.8856750Z FAILED tests/test_release_ref_safety.py::test_actual_checkout_verification[moved_tag-release-enterprise.yml-build] - UnicodeDecodeError: 'charmap' codec can't decode byte 0x9d in position 4830: character maps to <undefined>
2026-10-08T20:22:58.8857459Z FAILED tests/test_release_ref_safety.py::test_actual_checkout_verification[moved_tag-release-enterprise.yml-verify-source-checks] - UnicodeDecodeError: 'charmap' codec can't decode byte 0x9d in position 4830: character maps to <undefined>
2026-10-08T20:22:58.8858178Z FAILED tests/test_release_ref_safety.py::test_actual_checkout_verification[moved_tag-release-enterprise.yml-test-built-artifact] - UnicodeDecodeError: 'charmap' codec can't decode byte 0x9d in position 4830: character maps to <undefined>
2026-10-08T20:22:58.8858905Z FAILED tests/test_release_ref_safety.py::test_actual_checkout_verification[moved_tag-release-enterprise.yml-test-testpypi-install] - UnicodeDecodeError: 'charmap' codec can't decode byte 0x9d in position 4830: character maps to <undefined>
2026-10-08T20:22:58.8859639Z FAILED tests/test_release_ref_safety.py::test_actual_checkout_verification[moved_tag-release-enterprise.yml-create-github-release] - UnicodeDecodeError: 'charmap' codec can't decode byte 0x9d in position 4830: character maps to <undefined>
2026-10-08T20:22:58.8860336Z FAILED tests/test_release_ref_safety.py::test_actual_checkout_verification[missing_tag-release-enterprise.yml-build] - UnicodeDecodeError: 'charmap' codec can't decode byte 0x9d in position 4830: character maps to <undefined>
2026-10-08T20:22:58.8861154Z FAILED tests/test_release_ref_safety.py::test_actual_checkout_verification[missing_tag-release-enterprise.yml-verify-source-checks] - UnicodeDecodeError: 'charmap' codec can't decode byte 0x9d in position 4830: character maps to <undefined>
2026-10-08T20:22:58.8861873Z FAILED tests/test_release_ref_safety.py::test_actual_checkout_verification[missing_tag-release-enterprise.yml-test-built-artifact] - UnicodeDecodeError: 'charmap' codec can't decode byte 0x9d in position 4830: character maps to <undefined>
2026-10-08T20:22:58.8862675Z FAILED tests/test_release_ref_safety.py::test_actual_checkout_verification[missing_tag-release-enterprise.yml-test-testpypi-install] - UnicodeDecodeError: 'charmap' codec can't decode byte 0x9d in position 4830: character maps to <undefined>
2026-10-08T20:22:58.8863449Z FAILED tests/test_release_ref_safety.py::test_actual_checkout_verification[missing_tag-release-enterprise.yml-create-github-release] - UnicodeDecodeError: 'charmap' codec can't decode byte 0x9d in position 4830: character maps to <undefined>
2026-10-08T20:22:58.8864043Z FAILED tests/test_release_ref_safety.py::test_unknown_event_rejected[release-enterprise.yml] - UnicodeDecodeError: 'charmap' codec can't decode byte 0x9d in position 4830: character maps to <undefined>
2026-10-08T20:22:58.8864611Z FAILED tests/test_release_source_checks.py::test_stable_gate_binding_and_evidence - UnicodeDecodeError: 'charmap' codec can't decode byte 0x9d in position 4830: character maps to <undefined>
2026-10-08T20:22:58.8865356Z FAILED tests/test_trusted_publishing.py::test_publishers_only_download_and_upload[release-enterprise.yml-publish-test-pypi-testpypi] - UnicodeDecodeError: 'charmap' codec can't decode byte 0x9d in position 4830: character maps to <undefined>
2026-10-08T20:22:58.8866056Z FAILED tests/test_trusted_publishing.py::test_publishers_only_download_and_upload[release-enterprise.yml-publish-pypi-pypi] - UnicodeDecodeError: 'charmap' codec can't decode byte 0x9d in position 4830: character maps to <undefined>
2026-10-08T20:22:58.8866728Z FAILED tests/test_trusted_publishing.py::test_no_other_job_can_request_publishing_identity[release-enterprise.yml] - UnicodeDecodeError: 'charmap' codec can't decode byte 0x9d in position 4830: character maps to <undefined>
2026-10-08T20:22:58.8867378Z FAILED tests/test_trusted_publishing.py::test_stable_production_requires_unprivileged_index_verification - UnicodeDecodeError: 'charmap' codec can't decode byte 0x9d in position 4830: character maps to <undefined>
2026-10-08T20:22:58.8867709Z = 73 failed, 2668 passed, 32 skipped, 75 deselected, 77 subtests passed, 146 rerun in 405.09s (0:06:45) =
